BDBM50176653 2-(6-(4-methoxyphenyl)-5-(2-(5-methyl-2-phenyloxazol-4-yl)ethoxy)-2,3-dihydro-1H-inden-1-yl)butanoic acid::CHEMBL199509
SMILES CCC(C1CCc2cc(OCCc3nc(oc3C)-c3ccccc3)c(cc12)-c1ccc(OC)cc1)C(O)=O
InChI Key InChIKey=BVFHNBILEFPJHJ-UHFFFAOYSA-N
Data  2 EC50
  Tab Delimited (TSV)   2D SDfile   Computed 3D by Vconf -m prep SDfile
Find this compound or compounds like it in BindingDB:
Activity Spreadsheet -- Enzyme Inhibition Constant Data from BindingDB
Found 2 hits for monomerid = 50176653
TargetPeroxisome proliferator-activated receptor alpha(Homo sapiens (Human))
Bayer Research Center
Curated by ChEMBL
LigandPNGBDBM50176653(2-(6-(4-methoxyphenyl)-5-(2-(5-methyl-2-phenyloxaz...)
Affinity DataEC50:  23nM. Assay description: Activity against PPAR alpha in human by FRET assay
In DepthDetails ArticlePubMed
TargetPeroxisome proliferator-activated receptor gamma(Homo sapiens (Human))
Bayer Research Center
Curated by ChEMBL
LigandPNGBDBM50176653(2-(6-(4-methoxyphenyl)-5-(2-(5-methyl-2-phenyloxaz...)
Affinity DataEC50:  124nM. Assay description: Activity against PPAR gamma in human by FRET assay
In DepthDetails ArticlePubMed