BDBM50178455 CHEMBL202170::N-(4-fluorobenzyl)-6-(4-ethoxyphenyl)-4,5,7-trimethyl-6H-pyrrolo[3,4-d]pyridazin-1-amine
SMILES CCOc1ccc(cc1)-n1c(C)c2c(C)nnc(NCc3ccc(F)cc3)c2c1C
InChI Key InChIKey=JDKKIGNCPHGZFQ-UHFFFAOYSA-N
Data  1 IC50
  Tab Delimited (TSV)   2D SDfile   Computed 3D by Vconf -m prep SDfile
Find this compound or compounds like it in BindingDB:
Activity Spreadsheet -- Enzyme Inhibition Constant Data from BindingDB
Found 1 hit for monomerid = 50178455
TargetVoltage-dependent calcium channel subunit alpha-2/delta-1(Homo sapiens (Human))
Merck Research Laboratories
Curated by ChEMBL
LigandPNGBDBM50178455(CHEMBL202170 | N-(4-fluorobenzyl)-6-(4-ethoxypheny...)
Affinity DataIC50:  94nM. Assay description: [3H]Gabapentin binding in human A710 membrane expressing alpha2delta subunit of calcium channel
In DepthDetails ArticlePubMed