BDBM50178462 CHEMBL201818::N-butyl-6-(4-ethoxyphenyl)-4,5,7-trimethyl-6H-pyrrolo[3,4-d]pyridazin-1-amine
SMILES CCCCNc1nnc(C)c2c(C)n(c(C)c12)-c1ccc(OCC)cc1
InChI Key InChIKey=OSYBBWAMBPTLDW-UHFFFAOYSA-N
Data  1 IC50
  Tab Delimited (TSV)   2D SDfile   Computed 3D by Vconf -m prep SDfile
Find this compound or compounds like it in BindingDB:
Activity Spreadsheet -- Enzyme Inhibition Constant Data from BindingDB
Found 1 hit for monomerid = 50178462
TargetVoltage-dependent calcium channel subunit alpha-2/delta-1(Homo sapiens (Human))
Merck Research Laboratories
Curated by ChEMBL
LigandPNGBDBM50178462(CHEMBL201818 | N-butyl-6-(4-ethoxyphenyl)-4,5,7-tr...)
Affinity DataIC50:  61nM. Assay description: [3H]Gabapentin binding in human A710 membrane expressing alpha2delta subunit of calcium channel
In DepthDetails ArticlePubMed