BDBM50178476 1-(3,3-diphenylpyrrolidin-1-yl)-6-(4-ethoxyphenyl)-4,5,7-trimethyl-6H-pyrrolo[3,4-d]pyridazine::CHEMBL383739
SMILES CCOc1ccc(cc1)-n1c(C)c2c(C)nnc(N3CCC(C3)(c3ccccc3)c3ccccc3)c2c1C
InChI Key InChIKey=BLPLDXJUNAJFNY-UHFFFAOYSA-N
Data  1 IC50
  Tab Delimited (TSV)   2D SDfile   Computed 3D by Vconf -m prep SDfile
Find this compound or compounds like it in BindingDB:
Activity Spreadsheet -- Enzyme Inhibition Constant Data from BindingDB
Found 1 hit for monomerid = 50178476
TargetVoltage-dependent calcium channel subunit alpha-2/delta-1(Homo sapiens (Human))
Merck Research Laboratories
Curated by ChEMBL
LigandPNGBDBM50178476(1-(3,3-diphenylpyrrolidin-1-yl)-6-(4-ethoxyphenyl)...)
Affinity DataIC50:  153nM. Assay description: [3H]Gabapentin binding in human A710 membrane expressing alpha2delta subunit of calcium channel
In DepthDetails ArticlePubMed