BDBM50178482 2-(6-(4-ethoxyphenyl)-4,5,7-trimethyl-6H-pyrrolo[3,4-d]pyridazin-1-yl)-2,3,4,4b,8a,9-hexahydro-1H-pyrido[3,4-b]indole::CHEMBL201801
SMILES CCOc1ccc(cc1)-n1c(C)c2c(C)nnc(N3CCC4C5C=CC=CC5N=C4C3)c2c1C
InChI Key InChIKey=COPGHEGPGGZXLS-UHFFFAOYSA-N
Data  1 IC50
  Tab Delimited (TSV)   2D SDfile   Computed 3D by Vconf -m prep SDfile
Find this compound or compounds like it in BindingDB:
Activity Spreadsheet -- Enzyme Inhibition Constant Data from BindingDB
Found 1 hit for monomerid = 50178482
TargetVoltage-dependent calcium channel subunit alpha-2/delta-1(Homo sapiens (Human))
Merck Research Laboratories
Curated by ChEMBL
LigandPNGBDBM50178482(2-(6-(4-ethoxyphenyl)-4,5,7-trimethyl-6H-pyrrolo[3...)
Affinity DataIC50:  135nM. Assay description: [3H]Gabapentin binding in human A710 membrane expressing alpha2delta subunit of calcium channel
In DepthDetails ArticlePubMed