BDBM50178488 6-(4-ethoxyphenyl)-1,5,7-trimethyl-4-(pyrrolidin-1-yl)-6H-pyrrolo[3,4-d]pyridazine::CHEMBL372098
SMILES CCOc1ccc(cc1)-n1c(C)c2c(C)nnc(N3CCCC3)c2c1C
InChI Key InChIKey=PCRWZYAVPLYWTH-UHFFFAOYSA-N
Data  1 IC50
  Tab Delimited (TSV)   2D SDfile   Computed 3D by Vconf -m prep SDfile
Find this compound or compounds like it in BindingDB:
Activity Spreadsheet -- Enzyme Inhibition Constant Data from BindingDB
Found 1 hit for monomerid = 50178488
TargetVoltage-dependent calcium channel subunit alpha-2/delta-1(Homo sapiens (Human))
Merck Research Laboratories
Curated by ChEMBL
LigandPNGBDBM50178488(6-(4-ethoxyphenyl)-1,5,7-trimethyl-4-(pyrrolidin-1...)
Affinity DataIC50:  180nM. Assay description: [3H]Gabapentin binding in human A710 membrane expressing alpha2delta subunit of calcium channel
In DepthDetails ArticlePubMed