BDBM50179310 2-amino-7-benzyl-5,6,7,8-tetrahydro-4H-pyrido[4',3':4,5]thieno[2,3-d][1,3]oxazin-4-one::CHEMBL323163
SMILES Nc1nc2sc3CN(Cc4ccccc4)CCc3c2c(=O)o1
InChI Key InChIKey=HBUJNXVMIKVGHN-UHFFFAOYSA-N
Data  1 KI  1 IC50
  Tab Delimited (TSV)   2D SDfile   Computed 3D by Vconf -m prep SDfile
Find this compound or compounds like it in BindingDB:
Activity Spreadsheet -- Enzyme Inhibition Constant Data from BindingDB
Found 2 hits for monomerid = 50179310
TargetBile salt-activated lipase(Bos taurus)
University Of Bonn
Curated by ChEMBL
LigandPNGBDBM50179310(2-amino-7-benzyl-5,6,7,8-tetrahydro-4H-pyrido[4',3...)
Affinity DataKi: >5.00E+4nM. Assay description: Inhibitory activity against bovine pancreatic CEase in presence of pNPB chromogenic substrate by spectrophotometry
In DepthDetails ArticlePubMed
TargetAcetylcholinesterase(Electrophorus electricus (Electric eel))
University Of Bonn
Curated by ChEMBL
LigandPNGBDBM50179310(2-amino-7-benzyl-5,6,7,8-tetrahydro-4H-pyrido[4',3...)
Affinity DataIC50:  5.90E+3nM. Assay description: Inhibitory activity AChE from Electrophorus electricus using ATCh substrate and DTNB by spectrophotometry
In DepthDetails ArticlePubMed