BDBM50179332 7-benzyl-2-cyclohexylamino-5,6,7,8-tetrahydro-4H-pyrido[4',3':4,5]thieno[2,3-d][1,3]oxazin-4-one::CHEMBL121607
SMILES O=c1oc(NC2CCCCC2)nc2sc3CN(Cc4ccccc4)CCc3c12
InChI Key InChIKey=GOZIDNSQWCCLOP-UHFFFAOYSA-N
Data  1 KI
  Tab Delimited (TSV)   2D SDfile   Computed 3D by Vconf -m prep SDfile
Find this compound or compounds like it in BindingDB:
Activity Spreadsheet -- Enzyme Inhibition Constant Data from BindingDB
Found 1 hit for monomerid = 50179332
TargetBile salt-activated lipase(Bos taurus)
University Of Bonn
Curated by ChEMBL
LigandPNGBDBM50179332(7-benzyl-2-cyclohexylamino-5,6,7,8-tetrahydro-4H-p...)
Affinity DataKi: >5.00E+4nM. Assay description: Inhibitory activity against bovine pancreatic CEase in presence of pNPB chromogenic substrate by spectrophotometry
In DepthDetails ArticlePubMed