BDBM50181245 3-((3-(3-(1H-imidazol-1-yl)propyl)-5-methyl-5-(naphthalen-1-yl)-2,4-dioxoimidazolidin-1-yl)methyl)benzonitrile::CHEMBL378462
SMILES CC1(N(Cc2cccc(c2)C#N)C(=O)N(CCCn2ccnc2)C1=O)c1cccc2ccccc12
InChI Key InChIKey=QRBLNORQTYKILD-UHFFFAOYSA-N
Data  1 IC50
PDB links: 1 PDB ID matches this monomer.
  Tab Delimited (TSV)   2D SDfile   Computed 3D by Vconf -m prep SDfile
Find this compound or compounds like it in BindingDB:
Activity Spreadsheet -- Enzyme Inhibition Constant Data from BindingDB
Found 1 hit for monomerid = 50181245
TargetDimer of Protein farnesyltransferase subunit beta(Homo sapiens (Human))
Keimyung University
Curated by ChEMBL
LigandPNGBDBM50181245(3-((3-(3-(1H-imidazol-1-yl)propyl)-5-methyl-5-(nap...)
Affinity DataIC50:  0.0900nM. Assay description: Inhibition of farnesyl transferase