BDBM50181246 CHEMBL206795::N-(2-((3-(3-(1H-imidazol-1-yl)propyl)-5-methyl-5-(naphthalen-1-yl)-2,4-dioxoimidazolidin-1-yl)methyl)benzyl)methanesulfonamide
SMILES CC1(N(Cc2ccccc2CNS(C)(=O)=O)C(=O)N(CCCn2ccnc2)C1=O)c1cccc2ccccc12
InChI Key InChIKey=ORYMXHUFOAZSNG-UHFFFAOYSA-N
Data  1 IC50
  Tab Delimited (TSV)   2D SDfile   Computed 3D by Vconf -m prep SDfile
Find this compound or compounds like it in BindingDB:
Activity Spreadsheet -- Enzyme Inhibition Constant Data from BindingDB
Found 1 hit for monomerid = 50181246
TargetDimer of Protein farnesyltransferase subunit beta(Homo sapiens (Human))
Keimyung University
Curated by ChEMBL
LigandPNGBDBM50181246(CHEMBL206795 | N-(2-((3-(3-(1H-imidazol-1-yl)propy...)
Affinity DataIC50:  0.5nM. Assay description: Inhibition of farnesyl transferase
In DepthDetails ArticlePubMed