BDBM50183666 4-(2,4-dichlorobenzyl)-2-methylphthalazin-1(2H)-one::CHEMBL207779
SMILES Cn1nc(Cc2ccc(Cl)cc2Cl)c2ccccc2c1=O
InChI Key InChIKey=JFQCLVISCHEQIP-UHFFFAOYSA-N
Data  1 EC50
  Tab Delimited (TSV)   2D SDfile   Computed 3D by Vconf -m prep SDfile
Find this compound or compounds like it in BindingDB:
Activity Spreadsheet -- Enzyme Inhibition Constant Data from BindingDB
Found 1 hit for monomerid = 50183666
TargetAlpha-1D adrenergic receptor(Rattus norvegicus (Rat))
Universidad De Salamanca
Curated by ChEMBL
LigandPNGBDBM50183666(4-(2,4-dichlorobenzyl)-2-methylphthalazin-1(2H)-on...)
Affinity DataEC50:  1.20E+3nM. Assay description: Vasorelaxation of phenylephrine-stimulated Wistar rat aorta contraction
In DepthDetails ArticlePubMed