BDBM50185414 (4aS,6S,8aR)-6-(4-chloro-benzenesulfonyl)-6-(2,5-difluoro-phenyl)-3-propyl-octahydro-benzo[c][1,2]thiazine 2,2-dioxide::CHEMBL427397
SMILES CCCC1C[C@@H]2C[C@](CC[C@@H]2NS1(=O)=O)(c1cc(F)ccc1F)S(=O)(=O)c1ccc(Cl)cc1
InChI Key InChIKey=LKKZOKBTFIMOBZ-FHTGRLLHSA-N
Data  1 IC50
  Tab Delimited (TSV)   2D SDfile   Computed 3D by Vconf -m prep SDfile
Find this compound or compounds like it in BindingDB:
Activity Spreadsheet -- Enzyme Inhibition Constant Data from BindingDB
Found 1 hit for monomerid = 50185414
LigandPNGBDBM50185414((4aS,6S,8aR)-6-(4-chloro-benzenesulfonyl)-6-(2,5-d...)
Affinity DataIC50:  0.240nM. Assay description: Inhibition of gamma secretase
In DepthDetails ArticlePubMed