BDBM50189993 2-(4-(4-(3-chloro-2-fluorophenylamino)-7-methoxyquinazolin-6-yloxy)piperidin-1-yl)acetamide::CHEMBL218677
SMILES COc1cc2ncnc(Nc3cccc(Cl)c3F)c2cc1OC1CCN(CC(N)=O)CC1
InChI Key InChIKey=DIBGTMXGHUALIU-UHFFFAOYSA-N
Data  1 IC50
  Tab Delimited (TSV)   2D SDfile   Computed 3D by Vconf -m prep SDfile
Find this compound or compounds like it in BindingDB:
Activity Spreadsheet -- Enzyme Inhibition Constant Data from BindingDB
Found 1 hit for monomerid = 50189993
TargetEpidermal growth factor receptor(Homo sapiens (Human))
Astrazeneca
Curated by ChEMBL
LigandPNGBDBM50189993(2-(4-(4-(3-chloro-2-fluorophenylamino)-7-methoxyqu...)
Affinity DataIC50:  2nM. Assay description: Inhibition of EGFR
In DepthDetails ArticlePubMed