BDBM50190003 2-(4-(4-(5-chloro-2-fluorophenylamino)-7-methoxyquinazolin-6-yloxy)piperidin-1-yl)acetamide::CHEMBL214478
SMILES COc1cc2ncnc(Nc3cc(Cl)ccc3F)c2cc1OC1CCN(CC(N)=O)CC1
InChI Key InChIKey=DDAMGXWOIIQREF-UHFFFAOYSA-N
Data  1 IC50
  Tab Delimited (TSV)   2D SDfile   Computed 3D by Vconf -m prep SDfile
Find this compound or compounds like it in BindingDB:
Activity Spreadsheet -- Enzyme Inhibition Constant Data from BindingDB
Found 1 hit for monomerid = 50190003
TargetEpidermal growth factor receptor(Homo sapiens (Human))
Astrazeneca
Curated by ChEMBL
LigandPNGBDBM50190003(2-(4-(4-(5-chloro-2-fluorophenylamino)-7-methoxyqu...)
Affinity DataIC50:  9nM. Assay description: Inhibition of EGFR
In DepthDetails ArticlePubMed