BDBM50192743 3,4-Dihydroxybenzaldehyde::CHEBI:50205::Protocatechualdehyde
SMILES Oc1ccc(C=O)cc1O
InChI Key InChIKey=IBGBGRVKPALMCQ-UHFFFAOYSA-N
Data  3 IC50  1 Kd
PDB links: 1 PDB ID matches this monomer.
  Tab Delimited (TSV)   2D SDfile   Computed 3D by Vconf -m prep SDfile
Find this compound or compounds like it in BindingDB:
Activity Spreadsheet -- Enzyme Inhibition Constant Data from BindingDB
Found 1 hit for monomerid = 50192743
TargetReplicase polyprotein 1ab(Middle East respiratory syndrome-related coronavir...)
University Of Illinois At Chicago
Curated by ChEMBL
LigandPNGBDBM50192743(3,4-Dihydroxybenzaldehyde | CHEBI:50205 | Protocat...)
Affinity DataKd:  2.20E+5nM. Assay description: Binding affinity to MERS-CoV papain-like protease by SPR analysis
In DepthDetails ArticlePubMed