BDBM50193731 1-(4-(trifluoromethyl)benzyl)-N-(3-(trifluoromethyl)phenylsulfonyl)-1H-indole-2-carboxamide::CHEMBL218122
SMILES FC(F)(F)c1ccc(Cn2c(cc3ccccc23)C(=O)NS(=O)(=O)c2cccc(c2)C(F)(F)F)cc1
InChI Key InChIKey=UOCZVDFFAHAXML-UHFFFAOYSA-N
Data  1 IC50
  Tab Delimited (TSV)   2D SDfile   Computed 3D by Vconf -m prep SDfile
Find this compound or compounds like it in BindingDB:
Activity Spreadsheet -- Enzyme Inhibition Constant Data from BindingDB
Found 1 hit for monomerid = 50193731
TargetPeroxisome proliferator-activated receptor gamma(Homo sapiens (Human))
Procter And Gamble Pharmaceuticals
Curated by ChEMBL
LigandPNGBDBM50193731(1-(4-(trifluoromethyl)benzyl)-N-(3-(trifluoromethy...)
Affinity DataIC50:  400nM. Assay description: Displacement of Fluormone from PPAR gamma
In DepthDetails ArticlePubMed