BDBM50194126 (S)-N-(1-(8-(6-aminohexylamino)octylamino)-3-(4-hydroxyphenyl)-1-oxopropan-2-yl)butyramide::CHEMBL213885
SMILES CCCC(=O)N[C@@H](Cc1ccc(O)cc1)C(=O)NCCCCCCCCNCCCCCCN
InChI Key InChIKey=TVYZNVIXIMXUJQ-VWLOTQADSA-N
Data  1 KI
  Tab Delimited (TSV)   2D SDfile   Computed 3D by Vconf -m prep SDfile
Find this compound or compounds like it in BindingDB:
Activity Spreadsheet -- Enzyme Inhibition Constant Data from BindingDB
Found 1 hit for monomerid = 50194126
TargetGlutamate receptor 1(Rattus norvegicus (Rat))
The Danish University Of Pharmaceutical Sciences
Curated by ChEMBL
LigandPNGBDBM50194126((S)-N-(1-(8-(6-aminohexylamino)octylamino)-3-(4-hy...)
Affinity DataKi:  77nM. Assay description: Antagonist activity against rat GluR1 flop expressed in Xenopus laevis oocyte assessed as inhibition of glutamate-induced current at holding potentia...
In DepthDetails ArticlePubMed