BDBM50195813 CHEMBL3905695
SMILES COc1ccc(\C=C\C(=O)NCCC2CCN(Cc3ccccc3)CC2)cc1
InChI Key InChIKey=YCOGWPMXFGHUIP-FMIVXFBMSA-N
Data  2 IC50
  Tab Delimited (TSV)   2D SDfile   Computed 3D by Vconf -m prep SDfile
Find this compound or compounds like it in BindingDB:
Activity Spreadsheet -- Enzyme Inhibition Constant Data from BindingDB
Found 2 hits for monomerid = 50195813
TargetAcetylcholinesterase(Homo sapiens (Human))
Instituto De Qu£Mica M£Dica
Curated by ChEMBL
LigandPNGBDBM50195813(CHEMBL3905695)
Affinity DataIC50:  490nM. Assay description: Inhibition of human recombinant AChE using acetylthiocholine iodide as substrate preincubated for 5 mins followed by substrate addition measured for ...
In DepthDetails ArticlePubMed
TargetCholinesterase(Homo sapiens (Human))
Instituto De Qu£Mica M£Dica
Curated by ChEMBL
LigandPNGBDBM50195813(CHEMBL3905695)
Affinity DataIC50:  760nM. Assay description: Inhibition of human serum BuChE using butyrylthiocholine as substrate preincubated for 5 mins followed by substrate addition measured for 5 mins by E...
In DepthDetails ArticlePubMed