BDBM50195814 CHEMBL3818992
SMILES Oc1ccc(\C=C\C(=O)NCCC2CCN(Cc3ccccc3)CC2)cc1O
InChI Key InChIKey=UFQJPMAHMNYIOA-VQHVLOKHSA-N
Data  4 IC50
  Tab Delimited (TSV)   2D SDfile   Computed 3D by Vconf -m prep SDfile
Find this compound or compounds like it in BindingDB:
Activity Spreadsheet -- Enzyme Inhibition Constant Data from BindingDB
Found 4 hits for monomerid = 50195814
TargetAcetylcholinesterase(Homo sapiens (Human))
Instituto De Qu£Mica M£Dica
Curated by ChEMBL
LigandPNGBDBM50195814(CHEMBL3818992)
Affinity DataIC50:  1.75E+3nM. Assay description: Inhibition of human recombinant AChE using acetylthiocholine iodide as substrate preincubated for 5 mins followed by substrate addition measured for ...
In DepthDetails ArticlePubMed
TargetAmine oxidase [flavin-containing] A(Homo sapiens (Human))
Instituto De Qu£Mica M£Dica
Curated by ChEMBL
LigandPNGBDBM50195814(CHEMBL3818992)
Affinity DataIC50:  3.50E+3nM. Assay description: Inhibition of human recombinant MAOA using p-tyramine as substrate incubated for 15 mins by fluorimetric method
In DepthDetails ArticlePubMed
TargetCholinesterase(Homo sapiens (Human))
Instituto De Qu£Mica M£Dica
Curated by ChEMBL
LigandPNGBDBM50195814(CHEMBL3818992)
Affinity DataIC50:  690nM. Assay description: Inhibition of human serum BuChE using butyrylthiocholine as substrate preincubated for 5 mins followed by substrate addition measured for 5 mins by E...
In DepthDetails ArticlePubMed
TargetAmine oxidase [flavin-containing] B(Homo sapiens (Human))
Instituto De Qu£Mica M£Dica
Curated by ChEMBL
LigandPNGBDBM50195814(CHEMBL3818992)
Affinity DataIC50:  6.00E+3nM. Assay description: Inhibition of human recombinant MAOB using p-tyramine as substrate incubated for 15 mins by fluorimetric method
In DepthDetails ArticlePubMed