BDBM50195870 CHEMBL3978533
SMILES COc1ccc(\C=C\C(=O)Nc2ccc(CN(C)Cc3ccccc3)cc2)cc1
InChI Key InChIKey=DBXKIEJEFALTHY-SFQUDFHCSA-N
Data  7 IC50
  Tab Delimited (TSV)   2D SDfile   Computed 3D by Vconf -m prep SDfile
Find this compound or compounds like it in BindingDB:
Activity Spreadsheet -- Enzyme Inhibition Constant Data from BindingDB
Found 7 hits for monomerid = 50195870
TargetAmine oxidase [flavin-containing] A(Homo sapiens (Human))
Instituto De Qu£Mica M£Dica
Curated by ChEMBL
LigandPNGBDBM50195870(CHEMBL3978533)
Affinity DataIC50: >1.00E+5nM. Assay description: Inhibition of human recombinant MAOA using p-tyramine as substrate incubated for 15 mins by fluorimetric method
In DepthDetails ArticlePubMed
TargetAcetylcholinesterase(Homo sapiens (Human))
Instituto De Qu£Mica M£Dica
Curated by ChEMBL
LigandPNGBDBM50195870(CHEMBL3978533)
Affinity DataIC50:  5.76E+3nM. Assay description: Inhibition of human recombinant AChE using acetylthiocholine iodide as substrate preincubated for 5 mins followed by substrate addition measured for ...
In DepthDetails ArticlePubMed
TargetAmine oxidase [flavin-containing] B(Homo sapiens (Human))
Instituto De Qu£Mica M£Dica
Curated by ChEMBL
LigandPNGBDBM50195870(CHEMBL3978533)
Affinity DataIC50: >1.00E+5nM. Assay description: Inhibition of human recombinant MAOB using p-tyramine as substrate incubated for 15 mins by fluorimetric method
In DepthDetails ArticlePubMed
TargetAcetylcholinesterase(Electrophorus electricus (Electric eel))
China Pharmaceutical University
Curated by ChEMBL
LigandPNGBDBM50195870(CHEMBL3978533)
Affinity DataIC50:  3.72E+3nM. Assay description: Inhibition of electric eel AChE using acetylthiocholine iodide as substrate preincubated for 5 mins followed by substrate addition measured up to 180...
In DepthDetails ArticlePubMed
TargetCholinesterase(Homo sapiens (Human))
China Pharmaceutical University
Curated by ChEMBL
LigandPNGBDBM50195870(CHEMBL3978533)
Affinity DataIC50:  6.40E+3nM. Assay description: Inhibition of human serum BChE using S-butyrylthiocholine iodide as substrate preincubated for 5 mins followed by substrate addition measured up to 1...
In DepthDetails ArticlePubMed
TargetCholinesterase(Equus caballus (Horse))
China Pharmaceutical University
Curated by ChEMBL
LigandPNGBDBM50195870(CHEMBL3978533)
Affinity DataIC50:  8.21E+3nM. Assay description: Inhibition of equine serum BChE using S-butyrylthiocholine iodide as substrate preincubated for 5 mins followed by substrate addition measured up to ...
In DepthDetails ArticlePubMed
TargetAcetylcholinesterase(Homo sapiens (Human))
Instituto De Qu£Mica M£Dica
Curated by ChEMBL
LigandPNGBDBM50195870(CHEMBL3978533)
Affinity DataIC50:  4.56E+3nM. Assay description: Inhibition of human erythrocytic AChE using acetylthiocholine iodide as substrate preincubated for 5 mins followed by substrate addition measured up ...
In DepthDetails ArticlePubMed