BDBM50200286 CHEMBL3890138
SMILES COc1cc(cc(OC)c1OC)C(=O)NC[C@H](C)OC(=O)[C@@H]1CCCCN1S(=O)(=O)Cc1ccccc1
InChI Key InChIKey=UDMLUYFVFKHGIO-RXVVDRJESA-N
Data  2 IC50
  Tab Delimited (TSV)   2D SDfile   Computed 3D by Vconf -m prep SDfile
Find this compound or compounds like it in BindingDB:
Activity Spreadsheet -- Enzyme Inhibition Constant Data from BindingDB
Found 2 hits for monomerid = 50200286
TargetOuter membrane protein MIP(Legionella pneumophila)
University Of W£Rzburg
Curated by ChEMBL
LigandPNGBDBM50200286(CHEMBL3890138)
Affinity DataIC50:  2.24E+3nM. Assay description: Inhibition of Mip PPIase activity in Legionella pneumophila
In DepthDetails ArticlePubMed
TargetOuter membrane protein MIP(Legionella pneumophila)
University Of W£Rzburg
Curated by ChEMBL
LigandPNGBDBM50200286(CHEMBL3890138)
Affinity DataIC50:  2.20E+3nM. Assay description: Inhibition of Mip PPIase activity in Legionella pneumophila
In DepthDetails ArticlePubMed