BDBM50200299 CHEMBL3920840
SMILES C[C@H](CNC(=O)c1cccnc1)OC(=O)[C@@H]1CCCCN1S(=O)(=O)Cc1ccccc1
InChI Key InChIKey=NNMKHOCCDNRNAJ-XLIONFOSSA-N
Data  2 IC50
  Tab Delimited (TSV)   2D SDfile   Computed 3D by Vconf -m prep SDfile
Find this compound or compounds like it in BindingDB:
Activity Spreadsheet -- Enzyme Inhibition Constant Data from BindingDB
Found 2 hits for monomerid = 50200299
TargetOuter membrane protein MIP(Legionella pneumophila)
University Of W£Rzburg
Curated by ChEMBL
LigandPNGBDBM50200299(CHEMBL3920840)
Affinity DataIC50:  1.15E+4nM. Assay description: Inhibition of Mip PPIase activity in Legionella pneumophila
In DepthDetails ArticlePubMed
TargetOuter membrane protein MIP(Legionella pneumophila)
University Of W£Rzburg
Curated by ChEMBL
LigandPNGBDBM50200299(CHEMBL3920840)
Affinity DataIC50:  1.15E+4nM. Assay description: Inhibition of Mip PPIase activity in Legionella pneumophila
In DepthDetails ArticlePubMed