BDBM50206814 CHEMBL3899919
SMILES CCCCCCOC(=O)\N=C(/N)c1ccc(CC2N(CCn3c2nc2cc(ccc32)C2(CCCC2)C(=O)N2CCCC2)C(=O)OCCCCCC)cc1
InChI Key InChIKey=XLEQJOHUTWJBQQ-UHFFFAOYSA-N
Data  1 IC50
  Tab Delimited (TSV)   2D SDfile   Computed 3D by Vconf -m prep SDfile
Find this compound or compounds like it in BindingDB:
Activity Spreadsheet -- Enzyme Inhibition Constant Data from BindingDB
Found 1 hit for monomerid = 50206814
TargetThrombin(Oryctolagus cuniculus)
China Pharmaceutical University
Curated by ChEMBL
LigandPNGBDBM50206814(CHEMBL3899919)
Affinity DataIC50:  9.15E+4nM. Assay description: Inhibition of rabbit thrombin-induced platelet aggregation in rabbit platelet-rich plasma preincubated with rabbit liver microsomes for 4 hrs followe...
In DepthDetails ArticlePubMed