BDBM50207062 CHEMBL3959144
SMILES OC(=O)CC[C@H]1CCc2cc(ccc2O1)-c1cc(OC(F)(F)F)cc(Cl)c1F
InChI Key InChIKey=RANJMKMDNWDGRM-GFCCVEGCSA-N
Data  3 EC50
  Tab Delimited (TSV)   2D SDfile   Computed 3D by Vconf -m prep SDfile
Find this compound or compounds like it in BindingDB:
Activity Spreadsheet -- Enzyme Inhibition Constant Data from BindingDB
Found 3 hits for monomerid = 50207062
TargetFree fatty acid receptor 4(Homo sapiens (Human))
Merck
Curated by ChEMBL
LigandPNGBDBM50207062(CHEMBL3959144)
Affinity DataEC50:  72nM. Assay description: Agonist activity at human GPR120 short isoform expressed in CHOK1 cells assessed as increase in IP1 accumulation after 60 mins by HTRF assay
In DepthDetails ArticlePubMed
TargetFree fatty acid receptor 1(Homo sapiens (Human))
Merck
Curated by ChEMBL
LigandPNGBDBM50207062(CHEMBL3959144)
Affinity DataEC50:  2.20E+3nM. Assay description: Agonist activity at human GPR40 expressed in HEK293 cells assessed as increase in IP1 accumulation after 60 mins by HTRF assay
In DepthDetails ArticlePubMed
TargetFree fatty acid receptor 4(Homo sapiens (Human))
Merck
Curated by ChEMBL
LigandPNGBDBM50207062(CHEMBL3959144)
Affinity DataEC50:  17nM. Assay description: Agonist activity at human GPR120 short isoform expressed in CHOK1 cells assessed as beta-arrestin recruitment after 90 mins by luminescence assay
In DepthDetails ArticlePubMed