BDBM50210067 CHEMBL3884151
SMILES CCCCCC(O)CC(=O)CCc1cc(OC)c(O)c(c1)-c1cc(CCC(=O)CC(O)CCCCC)cc(OC)c1O
InChI Key InChIKey=PXEPVAYIMVKWSC-UHFFFAOYSA-N
Data  2 IC50
  Tab Delimited (TSV)   2D SDfile   Computed 3D by Vconf -m prep SDfile
Find this compound or compounds like it in BindingDB:
Activity Spreadsheet -- Enzyme Inhibition Constant Data from BindingDB
Found 2 hits for monomerid = 50210067
TargetLeukotriene A-4 hydrolase(Homo sapiens (Human))
Mansoura University
Curated by ChEMBL
LigandPNGBDBM50210067(CHEMBL3884151)
Affinity DataIC50: >1.00E+5nM. Assay description: Inhibition of recombinant C-terminal His-tagged human LTA4H aminopeptidase activity expressed in Escherichia coli using L-alanine-4-nitro-anilide hyd...
In DepthDetails ArticlePubMed
TargetLeukotriene A-4 hydrolase(Homo sapiens (Human))
Mansoura University
Curated by ChEMBL
LigandPNGBDBM50210067(CHEMBL3884151)
Affinity DataIC50:  7.78E+4nM. Assay description: Inhibition of recombinant C-terminal His-tagged human LTA4H epoxide hydrolase activity expressed in Escherichia coli assessed as reduction in LTB4 pr...
In DepthDetails ArticlePubMed