BDBM50212879 CHEMBL248144::[2'-(4,5-diphenyl-1H-imidazol-2-yl)-biphenyl-3-yloxy]-acetic acid
SMILES OC(=O)COc1cccc(c1)-c1ccccc1-c1nc(c([nH]1)-c1ccccc1)-c1ccccc1
InChI Key InChIKey=QZAIUSCFELFJJH-UHFFFAOYSA-N
Data  3 KI
  Tab Delimited (TSV)   2D SDfile   Computed 3D by Vconf -m prep SDfile
Find this compound or compounds like it in BindingDB:
Activity Spreadsheet -- Enzyme Inhibition Constant Data from BindingDB
Found 3 hits for monomerid = 50212879
TargetFatty acid-binding protein, adipocyte(Homo sapiens (Human))
Bristol-Myers Squibb Pharmaceutical Research Institute
Curated by ChEMBL
LigandPNGBDBM50212879(CHEMBL248144 | [2'-(4,5-diphenyl-1H-imidazol-2-yl)...)
Affinity DataKi:  9.30nM. Assay description: Displacement of 1,8-ANS from aFABP by fluorescence based-assay
In DepthDetails ArticlePubMed
TargetFatty acid-binding protein, heart(Homo sapiens (Human))
Bristol-Myers Squibb Pharmaceutical Research Institute
Curated by ChEMBL
LigandPNGBDBM50212879(CHEMBL248144 | [2'-(4,5-diphenyl-1H-imidazol-2-yl)...)
Affinity DataKi: >1.00E+3nM. Assay description: Displacement of 1,8-ANS from mFABP by fluorescence based-assay
In DepthDetails ArticlePubMed
TargetFatty acid-binding protein 5(Homo sapiens (Human))
Bristol-Myers Squibb Pharmaceutical Research Institute
Curated by ChEMBL
LigandPNGBDBM50212879(CHEMBL248144 | [2'-(4,5-diphenyl-1H-imidazol-2-yl)...)
Affinity DataKi: >2.00E+3nM. Assay description: Displacement of 1,8-ANS from eFABP by fluorescence based-assay
In DepthDetails ArticlePubMed