BDBM50219957 CHEMBL3085294
SMILES CCc1nc2c(ccnc2n1[C@H](C)C1CC1)-c1ccc(Cl)cc1Cl
InChI Key InChIKey=AAARPHXZKXDSID-LLVKDONJSA-N
Data  1 KI
  Tab Delimited (TSV)   2D SDfile   Computed 3D by Vconf -m prep SDfile
Find this compound or compounds like it in BindingDB:
Activity Spreadsheet -- Enzyme Inhibition Constant Data from BindingDB
Found 1 hit for monomerid = 50219957
TargetCorticotropin-releasing factor receptor 1/2(Rattus norvegicus (rat))
Bristol-Myers Squibb
Curated by ChEMBL
LigandPNGBDBM50219957(CHEMBL3085294)
Affinity DataKi:  0.600nM. Assay description: In vitro binding affinity to the CRF receptor in rat cortical homogenates
In DepthDetails ArticlePubMed