BDBM50219966 CHEMBL23959
SMILES CC[C@H](C1CC1)n1c(CC)nc2c(ccnc12)-c1ccc(Cl)cc1Cl
InChI Key InChIKey=ZFEOFCQPJMXUNV-QGZVFWFLSA-N
Data  1 KI
  Tab Delimited (TSV)   2D SDfile   Computed 3D by Vconf -m prep SDfile
Find this compound or compounds like it in BindingDB:
Activity Spreadsheet -- Enzyme Inhibition Constant Data from BindingDB
Found 1 hit for monomerid = 50219966
TargetCorticotropin-releasing factor receptor 1/2(Rattus norvegicus (rat))
Bristol-Myers Squibb
Curated by ChEMBL
LigandPNGBDBM50219966(CHEMBL23959)
Affinity DataKi:  0.200nM. Assay description: In vitro binding affinity to the CRF receptor in rat cortical homogenates
In DepthDetails ArticlePubMed