BDBM50220753 5-(6,7-dimethoxy-1,4-dihydro-indeno[1,2-c]pyrazol-3-yl)-pyridine-2-carbonitrile::5-(6,7-dimethoxy-2,4-dihydro-indeno[1,2-c]pyrazol-3-yl)-pyridine-2-carbonitrile::CHEMBL398750::Chk1_145
SMILES COc1cc2Cc3c(n[nH]c3-c2cc1OC)-c1ccc(nc1)C#N
InChI Key InChIKey=KIRCZKKYIGQKGG-UHFFFAOYSA-N
Data  3 IC50
  Tab Delimited (TSV)   2D SDfile   Computed 3D by Vconf -m prep SDfile
Find this compound or compounds like it in BindingDB:
Activity Spreadsheet -- Enzyme Inhibition Constant Data from BindingDB
Found 3 hits for monomerid = 50220753
TargetSerine/threonine-protein kinase Chk1(Homo sapiens (Human))
Csar
LigandPNGBDBM50220753(5-(6,7-dimethoxy-1,4-dihydro-indeno[1,2-c]pyrazol-...)
Affinity DataIC50:  0.810nM. Assay description: Abbott Kinase Enzymatics_CHK1/289 CDC25c - IC50(uM) (IC50)
In DepthDetails PubMed
TargetSerine/threonine-protein kinase Chk1(Homo sapiens (Human))
Csar
LigandPNGBDBM50220753(5-(6,7-dimethoxy-1,4-dihydro-indeno[1,2-c]pyrazol-...)
Affinity DataIC50:  0.800nM. Assay description: Inhibition of Chk1
In DepthDetails ArticlePubMed
TargetSerine/threonine-protein kinase Chk1(Homo sapiens (Human))
Csar
LigandPNGBDBM50220753(5-(6,7-dimethoxy-1,4-dihydro-indeno[1,2-c]pyrazol-...)
Affinity DataIC50:  0.810nM. Assay description: Inhibition of recombinant CHK1
In DepthDetails ArticlePubMed