BDBM50221030 CHEMBL313078
SMILES Oc1c2SCCc2nn1-c1ccc(cc1)[N+]([O-])=O
InChI Key InChIKey=UUIUKNZAYOJRKN-UHFFFAOYSA-N
Data  3 IC50
  Tab Delimited (TSV)   2D SDfile   Computed 3D by Vconf -m prep SDfile
Find this compound or compounds like it in BindingDB:
Activity Spreadsheet -- Enzyme Inhibition Constant Data from BindingDB
Found 3 hits for monomerid = 50221030
TargetUDP-N-acetylmuramoylalanine--D-glutamate ligase(Staphylococcus aureus (Firmicutes))
Wyeth Research
Curated by ChEMBL
LigandPNGBDBM50221030(CHEMBL313078)
Affinity DataIC50:  3.60E+4nM. Assay description: In vitro inhibitory activity against Staphylococcus aureus UDP-N-acetylmuramoyl-L-alanyl-D-glutamate synthetase
In DepthDetails ArticlePubMed
TargetUDP-N-acetylmuramate--L-alanine ligase(Staphylococcus aureus (Firmicutes))
Wyeth Research
Curated by ChEMBL
LigandPNGBDBM50221030(CHEMBL313078)
Affinity DataIC50:  7.21E+4nM. Assay description: In vitro inhibitory activity against Staphylococcus aureus UDP-N-acetylmuramoyl-L-alanine synthetase
In DepthDetails ArticlePubMed
TargetUDP-N-acetylenolpyruvoylglucosamine reductase(Staphylococcus aureus (Firmicutes))
Wyeth Research
Curated by ChEMBL
LigandPNGBDBM50221030(CHEMBL313078)
Affinity DataIC50:  2.12E+4nM. Assay description: In vitro inhibitory activity against Staphylococcus aureus UDP-N-acetylmuramate dehydrogenase
In DepthDetails ArticlePubMed