BDBM50223364 1-((4-phenyl-1H-imidazol-2-yl)methyl)-3-(5-(phenylthio)thiazol-2-yl)urea::CHEMBL237639
SMILES O=C(NCc1nc(c[nH]1)-c1ccccc1)Nc1ncc(Sc2ccccc2)s1
InChI Key InChIKey=JLECXGJGBGFQLF-UHFFFAOYSA-N
Data  2 IC50
  Tab Delimited (TSV)   2D SDfile   Computed 3D by Vconf -m prep SDfile
Find this compound or compounds like it in BindingDB:
Activity Spreadsheet -- Enzyme Inhibition Constant Data from BindingDB
Found 2 hits for monomerid = 50223364
TargetEnoyl-[acyl-carrier-protein] reductase [NADH] FabI(Escherichia coli)
Meiji Seika Kaisha
Curated by ChEMBL
LigandPNGBDBM50223364(1-((4-phenyl-1H-imidazol-2-yl)methyl)-3-(5-(phenyl...)
Affinity DataIC50: >3.30E+4nM. Assay description: Inhibition of Escherichia coli enoyl-ACP reductase FabI
In DepthDetails ArticlePubMed
TargetTrans-2-enoyl-ACP reductase II(Streptococcus pneumoniae)
Meiji Seika Kaisha
Curated by ChEMBL
LigandPNGBDBM50223364(1-((4-phenyl-1H-imidazol-2-yl)methyl)-3-(5-(phenyl...)
Affinity DataIC50:  37nM. Assay description: Inhibition of Streptococcus pneumoniae enoyl-ACP reductase FabK
In DepthDetails ArticlePubMed