BDBM50225522 CHEMBL165576
SMILES Cc1[nH]c2ccccc2c1CCCN1CCC(CC1)c1noc2cc(Cl)ccc12
InChI Key InChIKey=WBQKSUNBGYQJIN-UHFFFAOYSA-N
Data  1 IC50
  Tab Delimited (TSV)   2D SDfile   Computed 3D by Vconf -m prep SDfile
Find this compound or compounds like it in BindingDB:
Activity Spreadsheet -- Enzyme Inhibition Constant Data from BindingDB
Found 1 hit for monomerid = 50225522
TargetD(1A)/D(1B)/D(2)/D(3)/D(4) dopamine receptor(Rattus norvegicus (rat))
TBA
Curated by ChEMBL
LigandPNGBDBM50225522(CHEMBL165576)
Affinity DataIC50:  88nM. Assay description: Ability to inhibit the binding of [3H]spiroperidol in rat striatal tissue
In DepthDetails ArticlePubMed