BDBM50225525 CHEMBL164973
SMILES Fc1ccc(cc1)C(CCCN1CCC(CC1)c1noc2ccc(F)cc12)c1ccc(F)cc1
InChI Key InChIKey=FVQOFXJPTWIAFY-UHFFFAOYSA-N
Data  1 IC50
  Tab Delimited (TSV)   2D SDfile   Computed 3D by Vconf -m prep SDfile
Find this compound or compounds like it in BindingDB:
Activity Spreadsheet -- Enzyme Inhibition Constant Data from BindingDB
Found 1 hit for monomerid = 50225525
TargetD(1A)/D(1B)/D(2)/D(3)/D(4) dopamine receptor(Rattus norvegicus (rat))
TBA
Curated by ChEMBL
LigandPNGBDBM50225525(CHEMBL164973)
Affinity DataIC50:  140nM. Assay description: Ability to inhibit the binding of [3H]spiroperidol in rat striatal tissue
In DepthDetails ArticlePubMed