BDBM50226174 CHEMBL156355
SMILES NC(=O)Cc1ccc(I)cc1
InChI Key InChIKey=RKJMVTJNBPMLGH-UHFFFAOYSA-N
Data  1 KI
  Tab Delimited (TSV)   2D SDfile   Computed 3D by Vconf -m prep SDfile
Find this compound or compounds like it in BindingDB:
Activity Spreadsheet -- Enzyme Inhibition Constant Data from BindingDB
Found 1 hit for monomerid = 50226174
TargetAlcohol dehydrogenase S chain(Equus caballus)
TBA
Curated by ChEMBL
LigandPNGBDBM50226174(CHEMBL156355)
Affinity DataKi:  7.94E+3nM. Assay description: Inhibitory activity against horse liver alcohol dehydrogenase (ADH)
In DepthDetails ArticlePubMed