BDBM50226717 (+/-)-Pindobind::CHEMBL157881
SMILES CC(C)(NC(=O)CBr)C1CCC(C)(CC1)NCC(O)COc1cccc2[nH]ccc12
InChI Key InChIKey=KNGWXFIRAISQAP-UHFFFAOYSA-N
Data  2 KI  2 Kd
  Tab Delimited (TSV)   2D SDfile   Computed 3D by Vconf -m prep SDfile
Find this compound or compounds like it in BindingDB:
Activity Spreadsheet -- Enzyme Inhibition Constant Data from BindingDB
Found 4 hits for monomerid = 50226717
TargetBeta-1/Beta-2/Beta-3 adrenergic receptor(Rattus norvegicus (Rat))
TBA
Curated by ChEMBL
LigandPNGBDBM50226717((+/-)-Pindobind | CHEMBL157881)
Affinity DataKi:  0.460nM. Assay description: In vitro inhibition against purified human erythrocyte carbonic anhydrase II was determined (acetozolamide used as control.)
In DepthDetails ArticlePubMed
TargetBeta-1/Beta-2/Beta-3 adrenergic receptor(Rattus norvegicus (Rat))
TBA
Curated by ChEMBL
LigandPNGBDBM50226717((+/-)-Pindobind | CHEMBL157881)
Affinity DataKi:  1.30nM. Assay description: Binding affinity against beta adrenergic receptor from rat lung tissues was determined
In DepthDetails ArticlePubMed
TargetBeta-1/Beta-2/Beta-3 adrenergic receptor(Rattus norvegicus (Rat))
TBA
Curated by ChEMBL
LigandPNGBDBM50226717((+/-)-Pindobind | CHEMBL157881)
Affinity DataKd:  2.40nM. Assay description: Binding affinity against the [3H]dihydroalprenolol binding to beta adrenergic receptor of rat heart reticulocytes
In DepthDetails ArticlePubMed
TargetBeta-1/Beta-2/Beta-3 adrenergic receptor(Rattus norvegicus (Rat))
TBA
Curated by ChEMBL
LigandPNGBDBM50226717((+/-)-Pindobind | CHEMBL157881)
Affinity DataKd:  1.60nM. Assay description: In vitro inhibition against purified human erythrocyte carbonic anhydrase II was determined (acetozolamide used as control.)
In DepthDetails ArticlePubMed