BDBM50228089 CHEMBL393271::N-(4-fluorophenyl)piperidine-1-sulfonamide
SMILES Fc1ccc(NS(=O)(=O)N2CCCCC2)cc1
InChI Key InChIKey=RWCQKDYEPAQWKE-UHFFFAOYSA-N
Data  1 Kd
  Tab Delimited (TSV)   2D SDfile   Computed 3D by Vconf -m prep SDfile
Find this compound or compounds like it in BindingDB:
Activity Spreadsheet -- Enzyme Inhibition Constant Data from BindingDB
Found 1 hit for monomerid = 50228089
TargetPeptidyl-prolyl cis-trans isomerase FKBP1A(Homo sapiens (Human))
University Of California San Diego
Curated by ChEMBL
LigandPNGBDBM50228089(CHEMBL393271 | N-(4-fluorophenyl)piperidine-1-sulf...)
Affinity DataKd:  3.19E+5nM. Assay description: Binding affinity to human FKBP12 expressed in Escherichia coli BL21(DE3) by isothermal titration calorimetry
In DepthDetails ArticlePubMed