BDBM50228094 CHEMBL235260::N-(2-(methylthio)phenyl)-2-(2-(thiazol-4-yl)-1H-benzo[d]imidazol-1-yl)acetamide::cid_1520613
SMILES CSc1ccccc1NC(=O)Cn1c(nc2ccccc12)-c1cscn1
InChI Key InChIKey=MKXADKWNFKWNQP-UHFFFAOYSA-N
Data  1 Kd  3 EC50
  Tab Delimited (TSV)   2D SDfile   Computed 3D by Vconf -m prep SDfile
Find this compound or compounds like it in BindingDB:
Activity Spreadsheet -- Enzyme Inhibition Constant Data from BindingDB
Found 4 hits for monomerid = 50228094
TargetNuclear receptor coactivator 3(Homo sapiens (Human))
The Scripps Research Institute Molecular Screening Center
Curated by PubChem BioAssay
LigandPNGBDBM50228094(CHEMBL235260 | N-(2-(methylthio)phenyl)-2-(2-(thia...)
Affinity DataEC50: >7.94E+4nM. Assay description: Source (MLSCN Center Name): The Scripps Research Institute Molecular Screening Center http://molscreen.florida.scripps.edu/ Center Affiliation: The ...
In DepthDetails PCBioAssay
TargetPeptidyl-prolyl cis-trans isomerase FKBP1A(Homo sapiens (Human))
University Of California San Diego
Curated by ChEMBL
LigandPNGBDBM50228094(CHEMBL235260 | N-(2-(methylthio)phenyl)-2-(2-(thia...)
Affinity DataKd: >4.00E+6nM. Assay description: Binding affinity to human FKBP12 expressed in Escherichia coli BL21(DE3) by isothermal titration calorimetry
In DepthDetails ArticlePubMed
TargetNuclear receptor coactivator 1(Homo sapiens (Human))
The Scripps Research Institute Molecular Screening Center
Curated by PubChem BioAssay
LigandPNGBDBM50228094(CHEMBL235260 | N-(2-(methylthio)phenyl)-2-(2-(thia...)
Affinity DataEC50: >7.94E+4nM. Assay description: Source (MLSCN Center Name): The Scripps Research Institute Molecular Screening Center Center Affiliation: The Scripps Research Institute (TSRI) Assay...
In DepthDetails PCBioAssay
TargetNuclear receptor coactivator 2(Homo sapiens (Human))
The Scripps Research Institute Molecular Screening Center
Curated by PubChem BioAssay
LigandPNGBDBM50228094(CHEMBL235260 | N-(2-(methylthio)phenyl)-2-(2-(thia...)
Affinity DataEC50: >7.94E+4nM. Assay description: Source (MLSCN Center Name): The Scripps Research Institute Molecular Screening Center Center Affiliation: The Scripps Research Institute (TSRI) Assay...
In DepthDetails PCBioAssay