BDBM50228099 CHEMBL235297::benzyl 2-methyl-4-(2-morpholino-2-oxoethoxy)phenylcarbamate
SMILES Cc1cc(OCC(=O)N2CCOCC2)ccc1NC(=O)OCc1ccccc1
InChI Key InChIKey=BDCVMHWYMYQDEU-UHFFFAOYSA-N
Data  1 Kd
  Tab Delimited (TSV)   2D SDfile   Computed 3D by Vconf -m prep SDfile
Find this compound or compounds like it in BindingDB:
Activity Spreadsheet -- Enzyme Inhibition Constant Data from BindingDB
Found 1 hit for monomerid = 50228099
TargetPeptidyl-prolyl cis-trans isomerase FKBP1A(Homo sapiens (Human))
University Of California San Diego
Curated by ChEMBL
LigandPNGBDBM50228099(CHEMBL235297 | benzyl 2-methyl-4-(2-morpholino-2-o...)
Affinity DataKd: >1.50E+6nM. Assay description: Binding affinity to human FKBP12 expressed in Escherichia coli BL21(DE3) by isothermal titration calorimetry
In DepthDetails ArticlePubMed