BDBM50228100 1-(2,6-dimethylmorpholino)-2-(phenylthio)ethanone::CHEMBL237614
SMILES CC1CN(CC(C)O1)C(=O)CSc1ccccc1
InChI Key InChIKey=ODCICFYWBXVLHA-UHFFFAOYSA-N
Data  1 Kd
  Tab Delimited (TSV)   2D SDfile   Computed 3D by Vconf -m prep SDfile
Find this compound or compounds like it in BindingDB:
Activity Spreadsheet -- Enzyme Inhibition Constant Data from BindingDB
Found 1 hit for monomerid = 50228100
TargetPeptidyl-prolyl cis-trans isomerase FKBP1A(Homo sapiens (Human))
University Of California San Diego
Curated by ChEMBL
LigandPNGBDBM50228100(1-(2,6-dimethylmorpholino)-2-(phenylthio)ethanone ...)
Affinity DataKd:  7.26E+5nM. Assay description: Binding affinity to human FKBP12 expressed in Escherichia coli BL21(DE3) by isothermal titration calorimetry
In DepthDetails ArticlePubMed