BDBM50228107 1-morpholino-2-tosylethanone::CHEMBL409750
SMILES Cc1ccc(cc1)S(=O)(=O)CC(=O)N1CCOCC1
InChI Key InChIKey=VNKAWTKRHIUZOW-UHFFFAOYSA-N
Data  1 Kd
  Tab Delimited (TSV)   2D SDfile   Computed 3D by Vconf -m prep SDfile
Find this compound or compounds like it in BindingDB:
Activity Spreadsheet -- Enzyme Inhibition Constant Data from BindingDB
Found 1 hit for monomerid = 50228107
TargetPeptidyl-prolyl cis-trans isomerase FKBP1A(Homo sapiens (Human))
University Of California San Diego
Curated by ChEMBL
LigandPNGBDBM50228107(1-morpholino-2-tosylethanone | CHEMBL409750)
Affinity DataKd: >5.00E+6nM. Assay description: Binding affinity to human FKBP12 expressed in Escherichia coli BL21(DE3) by isothermal titration calorimetry
In DepthDetails ArticlePubMed