BDBM50228108 CHEMBL235927::N-isopropyl-4-(2-morpholino-2-oxoethoxy)benzenesulfonamide
SMILES CC(C)NS(=O)(=O)c1ccc(OCC(=O)N2CCOCC2)cc1
InChI Key InChIKey=UHRSWVOHVBCTHT-UHFFFAOYSA-N
Data  1 Kd
  Tab Delimited (TSV)   2D SDfile   Computed 3D by Vconf -m prep SDfile
Find this compound or compounds like it in BindingDB:
Activity Spreadsheet -- Enzyme Inhibition Constant Data from BindingDB
Found 1 hit for monomerid = 50228108
TargetPeptidyl-prolyl cis-trans isomerase FKBP1A(Homo sapiens (Human))
University Of California San Diego
Curated by ChEMBL
LigandPNGBDBM50228108(CHEMBL235927 | N-isopropyl-4-(2-morpholino-2-oxoet...)
Affinity DataKd: >1.00E+6nM. Assay description: Binding affinity to human FKBP12 expressed in Escherichia coli BL21(DE3) by isothermal titration calorimetry
In DepthDetails ArticlePubMed