BDBM50228113 CHEMBL391600::N-butyl-4-(2-morpholino-2-oxoethoxy)benzenesulfonamide
SMILES CCCCNS(=O)(=O)c1ccc(OCC(=O)N2CCOCC2)cc1
InChI Key InChIKey=ACRWDIGNAZFRJH-UHFFFAOYSA-N
Data  1 Kd
  Tab Delimited (TSV)   2D SDfile   Computed 3D by Vconf -m prep SDfile
Find this compound or compounds like it in BindingDB:
Activity Spreadsheet -- Enzyme Inhibition Constant Data from BindingDB
Found 1 hit for monomerid = 50228113
TargetPeptidyl-prolyl cis-trans isomerase FKBP1A(Homo sapiens (Human))
University Of California San Diego
Curated by ChEMBL
LigandPNGBDBM50228113(CHEMBL391600 | N-butyl-4-(2-morpholino-2-oxoethoxy...)
Affinity DataKd:  7.55E+5nM. Assay description: Binding affinity to human FKBP12 expressed in Escherichia coli BL21(DE3) by isothermal titration calorimetry
In DepthDetails ArticlePubMed