BDBM50228116 2-(benzo[d][1,3]dioxol-5-yloxy)-1-morpholinoethanone::CHEMBL235944
SMILES O=C(COc1ccc2OCOc2c1)N1CCOCC1
InChI Key InChIKey=ZLQOHQLIGXHEQO-UHFFFAOYSA-N
Data  1 Kd
  Tab Delimited (TSV)   2D SDfile   Computed 3D by Vconf -m prep SDfile
Find this compound or compounds like it in BindingDB:
Activity Spreadsheet -- Enzyme Inhibition Constant Data from BindingDB
Found 1 hit for monomerid = 50228116
TargetPeptidyl-prolyl cis-trans isomerase FKBP1A(Homo sapiens (Human))
University Of California San Diego
Curated by ChEMBL
LigandPNGBDBM50228116(2-(benzo[d][1,3]dioxol-5-yloxy)-1-morpholinoethano...)
Affinity DataKd:  5.76E+5nM. Assay description: Binding affinity to human FKBP12 expressed in Escherichia coli BL21(DE3) by isothermal titration calorimetry
In DepthDetails ArticlePubMed