BDBM50228120 CHEMBL396887::N-(3-chloro-4-methylphenyl)piperidine-1-sulfonamide
SMILES Cc1ccc(NS(=O)(=O)N2CCCCC2)cc1Cl
InChI Key InChIKey=KYHNKIMTEBFXQN-UHFFFAOYSA-N
Data  1 Kd
  Tab Delimited (TSV)   2D SDfile   Computed 3D by Vconf -m prep SDfile
Find this compound or compounds like it in BindingDB:
Activity Spreadsheet -- Enzyme Inhibition Constant Data from BindingDB
Found 1 hit for monomerid = 50228120
TargetPeptidyl-prolyl cis-trans isomerase FKBP1A(Homo sapiens (Human))
University Of California San Diego
Curated by ChEMBL
LigandPNGBDBM50228120(CHEMBL396887 | N-(3-chloro-4-methylphenyl)piperidi...)
Affinity DataKd:  1.35E+5nM. Assay description: Binding affinity to human FKBP12 expressed in Escherichia coli BL21(DE3) by isothermal titration calorimetry
In DepthDetails ArticlePubMed