BDBM50228124 2-(2,4-dichlorophenoxy)-1-morpholinoethanone::CHEMBL394982
SMILES Clc1ccc(OCC(=O)N2CCOCC2)c(Cl)c1
InChI Key InChIKey=HLHVROUVDPXPNJ-UHFFFAOYSA-N
Data  1 Kd
  Tab Delimited (TSV)   2D SDfile   Computed 3D by Vconf -m prep SDfile
Find this compound or compounds like it in BindingDB:
Activity Spreadsheet -- Enzyme Inhibition Constant Data from BindingDB
Found 1 hit for monomerid = 50228124
TargetPeptidyl-prolyl cis-trans isomerase FKBP1A(Homo sapiens (Human))
University Of California San Diego
Curated by ChEMBL
LigandPNGBDBM50228124(2-(2,4-dichlorophenoxy)-1-morpholinoethanone | CHE...)
Affinity DataKd: >1.03E+6nM. Assay description: Binding affinity to human FKBP12 expressed in Escherichia coli BL21(DE3) by isothermal titration calorimetry
In DepthDetails ArticlePubMed