BDBM50228130 CHEMBL392086::N-(2,3-dichlorophenyl)-2-(2-morpholino-2-oxoethoxy)benzamide
SMILES Clc1cccc(NC(=O)c2ccccc2OCC(=O)N2CCOCC2)c1Cl
InChI Key InChIKey=PBPWPCBZIWXJQB-UHFFFAOYSA-N
Data  1 Kd
  Tab Delimited (TSV)   2D SDfile   Computed 3D by Vconf -m prep SDfile
Find this compound or compounds like it in BindingDB:
Activity Spreadsheet -- Enzyme Inhibition Constant Data from BindingDB
Found 1 hit for monomerid = 50228130
TargetPeptidyl-prolyl cis-trans isomerase FKBP1A(Homo sapiens (Human))
University Of California San Diego
Curated by ChEMBL
LigandPNGBDBM50228130(CHEMBL392086 | N-(2,3-dichlorophenyl)-2-(2-morphol...)
Affinity DataKd: >5.00E+6nM. Assay description: Binding affinity to human FKBP12 expressed in Escherichia coli BL21(DE3) by isothermal titration calorimetry
In DepthDetails ArticlePubMed