BDBM50228133 2-(3,4-dimethylphenoxy)-1-morpholinoethanone::CHEMBL235036
SMILES Cc1ccc(OCC(=O)N2CCOCC2)cc1C
InChI Key InChIKey=GLZIDKKPKNREPI-UHFFFAOYSA-N
Data  1 Kd
  Tab Delimited (TSV)   2D SDfile   Computed 3D by Vconf -m prep SDfile
Find this compound or compounds like it in BindingDB:
Activity Spreadsheet -- Enzyme Inhibition Constant Data from BindingDB
Found 1 hit for monomerid = 50228133
TargetPeptidyl-prolyl cis-trans isomerase FKBP1A(Homo sapiens (Human))
University Of California San Diego
Curated by ChEMBL
LigandPNGBDBM50228133(2-(3,4-dimethylphenoxy)-1-morpholinoethanone | CHE...)
Affinity DataKd:  2.31E+5nM. Assay description: Binding affinity to human FKBP12 expressed in Escherichia coli BL21(DE3) by isothermal titration calorimetry
In DepthDetails ArticlePubMed