BDBM50230592 CHEMBL251889::N-(2-amino-pyridin-3-ylmethyl)-N-{2-[2-[(2-amino-pyridin-3-ylmethyl)-formyl-amino]-1-(2-hydroxy-ethyl)-propenyldisulfanyl]-4-hydroxy-1-methyl-but-1-enyl}-formamide
SMILES C\C(N(Cc1cccnc1N)C=O)=C(/CCO)SS\C(CCO)=C(\C)N(Cc1cccnc1N)C=O
InChI Key InChIKey=MWZUDTKJRZAEPN-SVJWQLCWSA-N
Data  1 EC50
  Tab Delimited (TSV)   2D SDfile   Computed 3D by Vconf -m prep SDfile
Find this compound or compounds like it in BindingDB:
Activity Spreadsheet -- Enzyme Inhibition Constant Data from BindingDB
Found 1 hit for monomerid = 50230592
TargetTransketolase(Homo sapiens (Human))
Array Biopharma
Curated by ChEMBL
LigandPNGBDBM50230592(CHEMBL251889 | N-(2-amino-pyridin-3-ylmethyl)-N-{2...)
Affinity DataEC50:  479nM. Assay description: Inhibition of transketolase in human HCT116 cells
In DepthDetails ArticlePubMed