BDBM50230595 CHEMBL251888::N-{2-[2-[acetyl-(2-amino-6-methyl-pyridin-3-ylmethyl)-amino]-1-(2-hydroxy-ethyl)-propenyldisulfanyl]-4-hydroxy-1-methyl-but-1-enyl}-N-(2-amino-6-methyl-pyridin-3-ylmethyl)-acetamide
SMILES CC(=O)N(Cc1ccc(C)nc1N)C(\C)=C(\CCO)SS\C(CCO)=C(\C)N(Cc1ccc(C)nc1N)C(C)=O
InChI Key InChIKey=OGSOMRUOKGBMNR-DQIQZUARSA-N
Data  1 EC50
  Tab Delimited (TSV)   2D SDfile   Computed 3D by Vconf -m prep SDfile
Find this compound or compounds like it in BindingDB:
Activity Spreadsheet -- Enzyme Inhibition Constant Data from BindingDB
Found 1 hit for monomerid = 50230595
TargetTransketolase(Homo sapiens (Human))
Array Biopharma
Curated by ChEMBL
LigandPNGBDBM50230595(CHEMBL251888 | N-{2-[2-[acetyl-(2-amino-6-methyl-p...)
Affinity DataEC50:  32nM. Assay description: Inhibition of transketolase in human HCT116 cells
In DepthDetails ArticlePubMed