BDBM50237928 CHEMBL4084312
SMILES CCCCS(=O)(=O)Oc1ccc2c(C)c(Cl)c(=O)oc2c1
InChI Key InChIKey=FSIICZKYFLPCIT-UHFFFAOYSA-N
Data  2 IC50
  Tab Delimited (TSV)   2D SDfile   Computed 3D by Vconf -m prep SDfile
Find this compound or compounds like it in BindingDB:
Activity Spreadsheet -- Enzyme Inhibition Constant Data from BindingDB
Found 2 hits for monomerid = 50237928
TargetIntestinal-type alkaline phosphatase(Homo sapiens (Human))
University Of Karachi
Curated by ChEMBL
LigandPNGBDBM50237928(CHEMBL4084312)
Affinity DataIC50:  3.22E+3nM. Assay description: Effect on human Glucocorticoid receptor (GR) in a whole cell assay to measure functional cellular GR-antagonism (GRAF)
In DepthDetails ArticlePubMed
TargetAlkaline phosphatase, tissue-nonspecific isozyme(Homo sapiens (Human))
University Of Karachi
Curated by ChEMBL
LigandPNGBDBM50237928(CHEMBL4084312)
Affinity DataIC50:  1.64E+3nM. Assay description: Inhibition of human TNAP using CDP-star as substrate pretreated for 10 mins followed by substrate addition measured after 10 mins by spectrophotometr...
In DepthDetails ArticlePubMed